Ontology for Linked Data
type: Ontology
description: This is a vocabulary for describing relationships betweem linked data objects and things fetched from the web.
version: $Id: link.n3,v 1.14 2011/12/20 20:31:46 timbl Exp $

URI
type: Property
comment: The URI requested in this access. This is NOT the relationship betwen a URI and a thing t identifiers

document
comment: An Information Resource, such as a web page, image, data file, etc.
same class as: InformationResource
disjoint with: Person

data document
comment: An Information Resource whose meaning which can directly mapped into the RDF model. For example a data file which can be reterived as RDF using HTTP.
subclass of: document
subclass of: Ontology

mailbox
comment: An end point in the Internet Mail sytem. Anything which has a URI in the malto: scheme is a Mailbox.
range: mbox
disjoint with: document
disjoint with: Person

is mentioned in
type: Property
comment: This class is mentioned in the following document
domain: Class
range: Resource
inverse of: mentions

mentions
type: Property
comment: This document mentions the following class
domain: Resource
range: Class
inverse of: is mentioned in

supports protocol
type: Property
comment: The application supports this network protocol.

access
type: Class
comment: An event in which a network access is made.

access
type: Class
comment: A network response to a request.

protocol event
type: Class
comment: A step in a network protocol, such as a request or response message.
subclass of: Message
subclass of: access

requested URI
type: Property
inverse of: request
domain: access

redirected request
type: Property
inverse of: redirected from
domain: access
range: access

response
type: Property
domain: access
range: access

uses source
type: Property
comment: A source file accessed in this session.
range: document
domain: session
inverse of: session

is used by
type: Property
comment: The range uses the domain as a resource.
inverse of: uses source

status
type: Property
comment: The status of a network access.

examples and test data
type: Property
comment: Soemthing which can be used as an example for testing purposes
domain: Project

session
type: Class
comment: A run of the application software in which various network acecssses etc happen.

session
type: Property
domain: Project
range: session

referrer
type: Property
comment: A resource which contains a reference to the subject. That is, one of the statements in the object file has the subject URI. This property is stored by the tabulator library to explain why it looked up a given URI. This can help trace an error when it was in fact a mis-spelling.
inverse of: refers to